{"text_format":"1","workbook":"xlsx","n_sheets":8,"sheets":["Uitleg Keu referentiemodel","Keu referentiemodel","Export van referentiemodel","Resultaten branche","Resultaten grootte effect","Resultaten onroerend goed","Resultaten spreidingsdiagrammen","Resultaten gekozen Branche"],"not_rendered":{"charts":1,"images":0,"macros":1,"external_links":0,"defined_names":23,"comments":0,"pivot_tables":0},"unopened":[],"bounds":{"document_bytes":16777216,"sheet_cells":100000,"rows_first":2000,"rows_last":500,"rows_between":2000,"halvings":0,"cell_chars":16384,"cell_head_chars":4096},"cells_cut":0,"cells_raw":0,"read":"whole","date_system":"1900"}

{"sheet":"Uitleg Keu referentiemodel","index":0,"n_rows":25,"n_cols":3,"rows_kept":25,"cut":false,"hidden":false,"merged":[[18,1,18,12],[14,1,14,12],[16,1,16,12],[12,1,12,12],[5,1,5,12],[7,1,7,12],[10,1,10,12],[9,1,9,12]]}
[]
["Voor Nederlandse niet-beursgenoteerde ondernemingen"]
["Uitleg  Keu Referentiemodel"]
[]
[]
[null,"Dit rekenmodel is ontwikkeld om de onderzoeksresultaten eenvoudig toepasbaar te maken. Het volledige onderzoek is te downloaden via onderstaande link:"]
[]
[null,"ValuePro Papers: Rendementseis niet-beursgenoteerde ondernemingen - ValuePro"]
[]
[null,"Sla het document op als \"Excel-werkmap met macro's\", start het document opnieuw op en druk op \"Macro's inschakelen\"."]
[null,"Wanneer u aangeeft in welke branche de onderneming actief is, of er sprake is van exploitatiegebonden onroerend goed, en in welke range de ondernemingswaarde zich bevindt, berekent het rekenmodel het te hanteren 95%-betrouwbaarheidsinterval. \n\nHet rekenmodel hanteert de gemiddelde Keu van de geselecteerde branche. Indien deze branche niet significant afwijkt van de totale onderzoeksgroep, wordt de gemiddelde Keu van het deciel toegepast.\n\nVervolgens kan de Keu worden gecorrigeerd voor de aanwezigheid van exploitatiegebonden onroerend goed en/of voor een afwijkende ondernemingswaarde ten opzichte van de gemiddelde ondernemingswaarde binnen de branche. Het laatste is niet van toepassing als de gemiddelde Keu van het deciel wordt gehanteerd. Het toepassen van dergelijke correcties is een subjectieve beoordeling van de waardeerder.\n\nHet is vervolgens aan u als waardeerder om te bepalen of u dit interval hanteert en, zo ja, waar binnen dit interval de onderneming volgens u moet worden gepositioneerd. U kunt dit bepalen aan de hand van de small- en specific firm elementen. Hierbij dient u zich te realiseren dat de weging en percentages van het BDO-model niet toegepast kunnen worden."]
[]
[null,"Gebruik de invulvelden om de vragen te beantwoorden. Alle vragen dienen beantwoord te worden voordat er een resultaat getoond kan worden."]
[]
[null,"Let op: het stapelen van verschillende onderzoeksresultaten leidt tot lagere statistische betrouwbaarheid."]
[]
[null,"Let op: de uitkomsten zijn niet toepasbaar op startups of scale ups."]
[]
[null,"Let op: de ondernemingswaarden in de dataset variëren van € 55.300 tot € 750.000.000. In het 10e deciel is de spreiding van de ondernemingswaarde hoog en lijkt de daling van de Keu te stagneren. Het toepassen van de onderzoeksresultaten op ondernemingen met een waarde buiten de onderzoeksresultaten (of binnen het tiende deciel) gaat gepaard met een lagere statistische betrouwbaarheid."]
[]
[]
[]
[null," "]
[]
[null,null," "]

{"sheet":"Keu referentiemodel","index":1,"n_rows":65,"n_cols":14,"rows_kept":65,"cut":false,"hidden":false,"merged":[[5,0,5,1],[29,0,29,1],[19,0,19,1],[60,0,60,1],[32,3,32,5],[29,3,29,5],[28,3,28,5],[18,0,18,1],[13,0,13,1]]}
[]
["Voor Nederlandse niet-beursgenoteerde ondernemingen"]
["Input Keu Referentiemodel"]
[]
[]
["Voer projectnaam in",null,null,"Output onderzoek"]
[null,null,null,{"$f":"IF(B9=\"Vul in\",\"95% betrouwbaarheidsinterval branche:\",\"95% betrouwbaarheidsinterval branche \" & B9 & \":\")","v":"95% betrouwbaarheidsinterval branche:"}]
["Input rekenmodel",null,null,"Min",{"$f":"_xlfn.XLOOKUP(B9,'Resultaten branche'!A2:A13,'Resultaten branche'!D2:D13,\"\")","v":""}]
["In welke branche is de onderneming actief?",{"$f":"INDEX('Resultaten branche'!$A$1:$A$14,'Keu referentiemodel'!C9+1)","v":"Vul in"},13,"Gemiddelde",{"$f":"_xlfn.XLOOKUP(B9,'Resultaten branche'!A2:A13,'Resultaten branche'!B2:B13,\"\")","v":""}]
["Is er sprake van exploitatiegebonden onroerend goed?",{"$f":"INDEX('Resultaten onroerend goed'!A1:A4,'Keu referentiemodel'!C10+1)","v":"Vul in"},3,"Max",{"$f":"_xlfn.XLOOKUP(B9,'Resultaten branche'!A2:A13,'Resultaten branche'!E2:E13,\"\")","v":""}]
["Wat is ongeveer de ondernemingswaarde? In euro's.",{"$f":"INDEX('Resultaten grootte effect'!E1:E14,'Keu referentiemodel'!C11+2)","v":"Vul in"},11,{"$f":"IF(B11=\"Vul in\",\"95% betrouwbaarheidsinterval grootte:\",\"95% betrouwbaarheidsinterval \" & C13 & \":\")","v":"95% betrouwbaarheidsinterval grootte:"}]
[null,null,{"$f":"IF(OR(B9=\"\",B9=\"Vul in\",B9=\"Anders\"),\"\",_xlfn.XLOOKUP(B9,'Resultaten branche'!A2:A12,'Resultaten branche'!I2:I12,\"\"))","v":""},"Min",{"$f":"_xlfn.XLOOKUP(C13,'Resultaten grootte effect'!A3:A12,'Resultaten grootte effect'!G3:G12,\"\")","v":""}]
[{"$f":"IF(B10=\"Vul in\",\"\",IF(B15=\"Nee\",\"\",\"Onroerend goed correctie:\"))","v":""},{"$f":"IF(B15=\"Nee\",\"\", IF(B10=\"Ja\", 'Resultaten onroerend goed'!B2, IF(B10=\"Nee\", 'Resultaten onroerend goed'!B3, \"\")))","v":""},{"$f":"_xlfn.XLOOKUP(B11,'Resultaten grootte effect'!E2:E13,'Resultaten grootte effect'!A2:A13,\"\")","v":0},"Gemiddelde",{"$f":"_xlfn.XLOOKUP(C13,'Resultaten grootte effect'!A3:A12,'Resultaten grootte effect'!F3:F12,\"\")","v":""}]
[{"$f":"IF('Keu referentiemodel'!B15=\"Nee\",\"\",\"Het aandeel exploitatie gebonden onroerend goed in de gehele onderzoeksgroep is 21% en in de branche \"&'Keu referentiemodel'!B9&TEXT(_xlfn.XLOOKUP('Keu referentiemodel'!B9,'Resultaten branche'!A2:A13,'Resultaten branche'!N2:N13,\"\"),\" 0%.\"))","v":"Het aandeel exploitatie gebonden onroerend goed in de gehele onderzoeksgroep is 21% en in de branche Vul in"},null,null,"Max",{"$f":"_xlfn.XLOOKUP(C13,'Resultaten grootte effect'!A3:A12,'Resultaten grootte effect'!H3:H12,\"\")","v":""},null,null,null,null,null,null,null," "]
["Wilt u een correctie toepassen vanwege het wel of niet aanwezig zijn van exploitatiegebonden onroerend goed?",{"$f":"INDEX('Resultaten onroerend goed'!A1:A4,'Keu referentiemodel'!C15+1)","v":"Vul in"},3,{"$f":"_xlfn.CONCAT(\"Spreidingsdiagram \",IF(B9=\"Vul in\",\"\",B9))","v":"Spreidingsdiagram "}]
[null,null,null,null,null,null,null,null,null,null,null,null,null," "]
["Aanvullende input t.a.v. omvang"]
[{"$f":"IFERROR(IF(_xlfn.XLOOKUP(B9,'Resultaten branche'!A2:A12,'Resultaten branche'!C2:C12)=\"Ja\",\"De gekozen branche bevindt zich in \" & C12 & \" en\" & \" de onderneming bevind zich in \" & C13 &\".\",\"\"),\"\")","v":""}]
[{"$f":"IFERROR(IF(_xlfn.XLOOKUP(B9,'Resultaten branche'!A2:A12,'Resultaten branche'!C2:C12)=\"Ja\",\"Bekijk de spreidingsdiagram aan de rechterzijde. Indien de onderneming sterk afwijkt van de overige observaties, pas dan mogelijk een grootte correctie toe.\",\"\"),\"\")","v":""}]
[{"$f":"IF(    _xlfn.XLOOKUP('Keu referentiemodel'!B9,'Resultaten branche'!A2:A12,'Resultaten branche'!C2:C12)=\"Ja\", \"De mediaan van de ondernemingswaarde in de branche \" & 'Keu referentiemodel'!B9 & \" is \" & TEXT(_xlfn.XLOOKUP('Keu referentiemodel'!B9,'Resultaten branche'!A2:A12,'Resultaten branche'!H2:H12),\"€ #.###.###\") & \" en het gemiddelde is \" & TEXT(_xlfn.XLOOKUP('Keu referentiemodel'!B9,'Resultaten branche'!A2:A12,'Resultaten branche'!G2:G12),\"€ #.###.###\") & \".\",\"\")","v":{"$error":"#N/A"}}]
["Grootte correcte:",{"$f":"IFERROR(IF(B22=\"Nee\",\"\",_xlfn.XLOOKUP('Keu referentiemodel'!C13,'Resultaten grootte effect'!A3:A12,'Resultaten grootte effect'!F3:F12)-_xlfn.XLOOKUP(C12,'Resultaten grootte effect'!A3:A12,'Resultaten grootte effect'!F3:F12)),\"\")","v":""}]
["Wilt u een grootte correctie toepassen omdat de onderneming sterk afwijkt van de \nbranche grootte?",{"$f":"INDEX('Resultaten onroerend goed'!A1:A4,'Keu referentiemodel'!C22+1)","v":"Ja"},1]
[]
["Voorgesteld 95% betrouwbaarheidsinterval"]
["Min",{"$f":"IFERROR(B26-(MAX(E10-E8,E14-E12)/2),\"\")","v":""}]
["Gemiddelde",{"$f":"IFERROR(IF(_xlfn.XLOOKUP(B9,'Resultaten branche'!A2:A13,'Resultaten branche'!C2:C13)=\"Nee\",E13+IF(ISNUMBER(B13),B13,0),E9+IF(ISNUMBER(B13),B13,0)+IF(ISNUMBER(B21),B21,0)),\"\")","v":""}]
["Max",{"$f":"IFERROR(B26+(MAX(E10-E8,E14-E12)/2),\"\")","v":""}]
[]
["Keuze voor het vastellen Keu",null,null,{"$f":"IFERROR(IF(_xlfn.XLOOKUP(B9,'Resultaten branche'!A2:A12,'Resultaten branche'!C2:C12)=\"Ja\",IF(COUNTIF('Resultaten spreidingsdiagrammen'!C392:C396,B9)>0,\"Voor de leesbaarheid wordt de volgende observatie(s) van de gekozen branche niet getoond:\", \"\"),\"\"),\"\")","v":""}]
["Indien u het 95% betrouwbaarheidsinterval toepasbaar vindt kunt u aan de hand van de Small firm en Specific firm elementen bepalen waar de onderneming zich bevind in het betrowbaarheidsinterval. ",null,null,{"$f":"IFERROR(IF(_xlfn.XLOOKUP(B9,'Resultaten branche'!A2:A12,'Resultaten branche'!C2:C12)=\"Ja\",_xlfn.TEXTJOIN(\", \",TRUE,_xlfn._xlws.FILTER('Resultaten spreidingsdiagrammen'!A391:A396 & \" & \" & 'Resultaten spreidingsdiagrammen'!B391:B396,'Resultaten spreidingsdiagrammen'!C391:C396=B9)),\"\"),\"\")","v":""}]
["Let op: u kunt niet de weging en de percentages hanteren uit het BDO-model. "]
[]
["De small firm elementen kunnen beoordeeld worden aan de volgende dimensies:",null,null," "]
["Afhankelijkheid afnemers ","Vul +/- correctie in"]
[]
["Afhankelijkheid leveranciers","Vul +/- correctie in"]
[]
["Afhankelijkheid management","Vul +/- correctie in"]
["De specific firm premium elementen kunnen beoordeeld worden aan de volgende elementen:",null,null,{"$f":"IFERROR(IF(_xlfn.XLOOKUP(B9,'Resultaten branche'!A2:A12,'Resultaten branche'!C2:C12)=\"Nee\",IF(COUNTIF('Resultaten spreidingsdiagrammen'!C392:C396,B9)>0,\"Voor de leesbaarheid wordt de volgende observatie(s) van de gekozen branche niet getoond:\", \"\"),\"\"),\"\")","v":""}]
["Merknaam en reputatie ","Vul +/- correctie in",null,{"$f":"IFERROR(IF(_xlfn.XLOOKUP(B9,'Resultaten branche'!A2:A12,'Resultaten branche'!C2:C12)=\"Nee\",_xlfn.TEXTJOIN(\", \",TRUE,_xlfn._xlws.FILTER('Resultaten spreidingsdiagrammen'!A391:A396 & \" & \" & 'Resultaten spreidingsdiagrammen'!B391:B396,'Resultaten spreidingsdiagrammen'!C391:C396=B9)),\"\"),\"\")","v":""}]
{"$rows_left_out":26}
{"sheet":"Export van referentiemodel","index":2,"n_rows":70,"n_cols":3,"rows_kept":70,"cut":false,"hidden":true,"merged":[[69,0,69,2],[63,0,63,2],[4,0,4,2],[24,0,24,2],[61,0,61,2],[30,0,30,2],[13,0,13,2],[17,0,17,2],[21,0,21,2],[58,0,58,2],[40,0,40,1],[9,0,9,2]]}
[]
["Rendementseis Nederlandse niet-beursgenoteerde ondernemingen"]
["Uitkomst Keu Referentiemodel"]
[]
["Onderstaande overzicht geeft de te hanteren Keu op basis van het onderzoek naar de rendementseis van Nederlandse niet-beursgenoteerde ondernemingen. Dit onderzoek is gepubliceerd door ValuePro Haarlem B.V. in september 2025."]
[]
["Het onderzoek kan via onderstaande link gedownload worden."]
["ValuePro Papers: Rendementseis niet-beursgenoteerde ondernemingen - ValuePro"]
[]
[{"$f":"IF('Keu referentiemodel'!A6=\"Voer projectnaam in\",\"\",\"Keu referentiemodel voor project \" &'Keu referentiemodel'!A6)","v":""}]
[]
["Gekozen uitgangspunten van waardeerder:"]
["Branche waarin de onderneming actief is",null,{"$f":"IF('Keu referentiemodel'!B9=\"Vul in\",\"Veld is niet ingevuld\",'Keu referentiemodel'!B9)","v":"Veld is niet ingevuld"}]
[{"$f":"IF(_xlfn.XLOOKUP('Keu referentiemodel'!B9,'Resultaten branche'!A2:A12,'Resultaten branche'!C2:C12)=\"Ja\",\"De branche \"& 'Keu referentiemodel'!B9 & \" wijkt significant af van de totale onderzoeksgroep.\",\"De branche \"& 'Keu referentiemodel'!B9 & \" wijkt niet significant af van de totale onderzoeksgroep.\")","v":{"$error":"#N/A"}}]
[]
["Is er sprake van exploitatie gebonden onroerend goed?",null,{"$f":"IF('Keu referentiemodel'!B10=\"Vul in\",\"Veld is niet ingevuld\",'Keu referentiemodel'!B10)","v":"Veld is niet ingevuld"}]
["-","Wilt u een correctie toepassen voor het aanwezig zijn van exploitatie gebonden onroerend goed?",{"$f":"IF('Keu referentiemodel'!B15=\"Nee\",'Keu referentiemodel'!B15,'Keu referentiemodel'!B15&\", correctie: \"&TEXT('Keu referentiemodel'!B13,\"#0,00%\"))","v":"Vul in, correctie: "}]
[{"$f":"IF('Keu referentiemodel'!B15=\"Vul in\",\"\",\"Het aandeel exploitatie gebonden onroerend goed in de gehele onderzoeksgroep is 21% en in de branche \"&'Keu referentiemodel'!B9&TEXT(_xlfn.XLOOKUP('Keu referentiemodel'!B9,'Resultaten branche'!A2:A13,'Resultaten branche'!N2:N13,\"\"),\" 0%\"))","v":""}]
[]
["Range van de ondernemingswaarde in euro's",null,{"$f":"IF('Keu referentiemodel'!B11=\"Vul in\",\"Veld is niet ingevuld\",'Keu referentiemodel'!B11)","v":"Veld is niet ingevuld"}]
[{"$f":"IF(_xlfn.XLOOKUP('Keu referentiemodel'!B9,'Resultaten branche'!A2:A12,'Resultaten branche'!C2:C12)=\"Ja\",\"-\",\"\")","v":{"$error":"#N/A"}},{"$f":"IF(_xlfn.XLOOKUP('Keu referentiemodel'!B9,'Resultaten branche'!A2:A12,'Resultaten branche'!C2:C12)=\"Ja\",\"Wilt u een grootte correctie toepassen?\",\"\")","v":{"$error":"#N/A"}},{"$f":"IF(_xlfn.XLOOKUP('Keu referentiemodel'!B9,'Resultaten branche'!A2:A12,'Resultaten branche'!C2:C12)=\"Ja\",IF('Keu referentiemodel'!B22=\"Nee\",'Keu referentiemodel'!B22,'Keu referentiemodel'!B22&\", correctie: \"&TEXT('Keu referentiemodel'!B21,\"#0,00%\")),\"\")","v":{"$error":"#N/A"}}]
[{"$f":"IF(_xlfn.XLOOKUP('Keu referentiemodel'!B9,'Resultaten branche'!A2:A12,'Resultaten branche'!C2:C12)=\"Ja\",\"De mediaan van de ondernemingswaarde in de branche \"&'Keu referentiemodel'!B9&\" is \"&TEXT(_xlfn.XLOOKUP('Keu referentiemodel'!B9,'Resultaten branche'!A2:A12,'Resultaten branche'!H2:H12,\"\"),\"€ #.###.###\")&\" en het gemiddelde is \"&TEXT(_xlfn.XLOOKUP('Keu referentiemodel'!B9,'Resultaten branche'!A2:A12,'Resultaten branche'!G2:G12,\"\"),\"€ #.###.###\")&\".\",\"\")","v":{"$error":"#N/A"}}]
[]
["Uitkomsten  rekenmodel:"]
["Als het 95%-betrouwbaarheidsinterval volgens de waardeerder toepasbaar is, kan het onderstaande interval worden gebruikt."]
["Minimale Keu, op basis van een 95% betrouwbaarheid interval",null,{"$f":"'Keu referentiemodel'!B25","v":""}]
["Gemiddelde Keu",null,{"$f":"'Keu referentiemodel'!B26","v":""}]
["Maximale Keu, op basis van een 95% betrouwbaarheid interval",null,{"$f":"'Keu referentiemodel'!B27","v":""}]
[]
["Keuze voor het vastellen Keu:"]
["De keuze waar in het 95% betrouwbaarheidsinterval de onderneming zich bevind kan bepaald worden aan de hand van de small en specific firm elementen."]
[]
["De small firm elementen:",null,"Gehanteerde correctie:"]
["Afhankelijkheid afnemers ",null,{"$f":"'Keu referentiemodel'!B34","v":"Vul +/- correctie in"}]
["Afhankelijkheid leveranciers",null,{"$f":"'Keu referentiemodel'!B36","v":"Vul +/- correctie in"}]
["Afhankelijkheid management",null,{"$f":"'Keu referentiemodel'!B38","v":"Vul +/- correctie in"}]
[]
[]
[]
[]
{"$rows_left_out":31}
{"sheet":"Resultaten branche","index":3,"n_rows":16,"n_cols":14,"rows_kept":16,"cut":false,"hidden":true,"merged":[]}
[null,"Gemiddelde Keu","significant verschil totaal","95% interval min","95% interval max","Grootte interval","Gemiddelde ondernemingswaarde","Mediaan ondernemingswaarde","Deciel Gem. OW","Min. ondernemingswaarde","Max. ondernemingswaarde ","Range","Aantal observaties","Aandeel OG in subgroep"]
["Agri & Food",0.14499999999999999,"ja",0.13300000000000001,0.15659999999999999,{"$f":"E2-D2","v":2.3599999999999982E-2},20199050,6286000,"Deciel 9",204260,129300000,{"$f":"TEXT(J2,\"#.##0\") & \" - \" & TEXT(K2,\"#.##0\")","v":"204.260 - 129.300.000"},17,0.35]
["Automotive, Transport & Logistiek",0.1472,"ja",0.1363,0.15809999999999999,{"$f":"E3-D3","v":2.1799999999999986E-2},10083160,7282835,"Deciel 8",609000,48115000,{"$f":"TEXT(J3,\"#.##0\") & \" - \" & TEXT(K3,\"#.##0\")","v":"609.000 - 48.115.000"},25,0.28000000000000003]
["Bouw & Installatietechniek",0.16402,"nee",0.15765999999999999,0.17038600000000001,1.2726000000000015E-2,6867980,2458841,"Deciel 7",442080,83729000,"442.080 - 83.729.000",70,0.24]
["Detailhandel",0.15590709999999999,"nee",0.13855870000000001,0.17325560000000001,3.4696900000000003E-2,5789340,579518.5,"Deciel 7",90000,48767000,"90.000 - 48.767.000",14,0.15]
["Gezondheidszorg & Farmacie",0.15836349999999999,"nee",0.1448094,0.1719176,2.7108199999999999E-2,40116020,3571000,"Deciel 10",215000,750000000,"215.000 - 750.000.000",23,0.09]
["Groothandel",0.15166299999999999,"ja",0.14155010000000001,0.1617759,2.0225799999999988E-2,16204400,3806500,"Deciel 9",233000,180000000,"233.000 - 180.000.000",42,0.26]
["Horeca, Toerisme & Recreatie",0.16731650000000001,"nee",0.14489099999999999,0.1897421,4.4851100000000005E-2,11109500,1124000,"Deciel 8",55400,109900000,"55.400 - 109.900.000",12,0.17]
["Industrie & Productie",0.15088099999999999,"ja",0.1446249,0.1571372,1.2512300000000004E-2,14648120,6896494.5,"Deciel 9",159000,132732000,"159.000 - 132.732.000",74,0.3]
["IT, Online & E-commerce",0.18146780000000001,"ja",0.1723963,0.19053929999999999,1.8142999999999992E-2,5554040,2785644,"Deciel 7",56960,21706000,"56.960 - 21.706.000",47,0.04]
["Media, Reclame & Communicatie",0.16743839999999999,"nee",0.15000540000000001,0.18487129999999999,3.4865899999999977E-2,3263480,1240500,"Deciel 6",527000,10570000,"527.000 - 10.570.000",10,0.1]
["Zakelijke dienstverlening",0.17094899999999999,"ja",0.16376489999999999,0.17813309999999999,1.4368199999999998E-2,4267360,2664411,"Deciel 6",101870,35992000,"101.870 - 35.992.000",53,0.15]
["Anders",0.16044610000000001,"nee",null,null,null,null,null,null,null,null,">35.992.000"]
["Vul in"]
[]
["Totale onderzoeksgroep",0.16089999999999999]

{"sheet":"Resultaten grootte effect","index":4,"n_rows":13,"n_cols":8,"rows_kept":13,"cut":false,"hidden":true,"merged":[[0,6,0,7]]}
["Deciel","Min.","Max.","Gemiddelde",null,"Gemiddelde Keu","95% betrouwbaarheidsinterval"]
["De onderneming valt buiten de onderzoeksresultaten",null,null,null,"< 55.399"]
["Deciel 1",55399,566559.6,343281.69230769231,{"$f":"TEXT(B3,\"#.##0\") & \" - \" & TEXT(C3,\"#.##0\")","v":"55.399 - 566.560"},0.17710000000000001,0.16800000000000001,0.1862]
["Deciel 2",566559.6,934800,747771.4615384615,{"$f":"TEXT(B4,\"#.##0\") & \" - \" & TEXT(C4,\"#.##0\")","v":"566.560 - 934.800"},0.17230000000000001,0.16370000000000001,0.18099999999999999]
["Deciel 3",934800,1501578.1,1265758.923076923,"934.800 - 1.501.578",0.16869999999999999,0.1605,0.1769]
["Deciel 4",1501578.1,2333200,1893401.8421052631,"1.501.578 - 2.333.200",0.16700000000000001,0.15920000000000001,0.17480000000000001]
["Deciel 5",2333200,3195500,2687045.512820513,"2.333.200 - 3.195.500",0.16339999999999999,0.155,0.17180000000000001]
["Deciel 6",3195500,4809600,4030880.2564102565,"3.195.500 - 4.809.600",0.16109999999999999,0.15290000000000001,0.16930000000000001]
["Deciel 7",4809600,7594696.7000000002,5836905.7368421052,"4.809.600 - 7.594.697",0.16209999999999999,0.1542,0.17]
["Deciel 8",7594696.7000000002,11811400,9510183.41025641,"7.594.697 - 11.811.400",0.15840000000000001,0.1472,0.1696]
["Deciel 9",11811400,23677300,16873409.948717948,"11.811.400 - 23.677.300",0.1416,0.13389999999999999,0.14940000000000001]
["Deciel 10",23677300,750000000,72341246.205128208,"23.677.300 - 750.000.000",0.13750000000000001,0.1273,0.1477]
[null,null,null,null,"Vul in"]

{"sheet":"Resultaten onroerend goed","index":5,"n_rows":4,"n_cols":2,"rows_kept":4,"cut":false,"hidden":true,"merged":[]}
["Exploitatie gebonden onroerend goed aanwezig:","Correctie"]
["Ja",-1.5899999999999997E-2]
["Nee",3.9000000000000146E-3]
["Vul in"]

{"sheet":"Resultaten spreidingsdiagrammen","index":6,"n_rows":396,"n_cols":3,"rows_kept":396,"cut":false,"hidden":true,"merged":[]}
["Ondernemingswaarde ","Keu","In welke branche was de waardering?"]
[55399,0.153,"Horeca, Toerisme & Recreatie"]
[56963,0.17975000000000002,"IT, Online & E-commerce"]
[65460,0.1976,"IT, Online & E-commerce"]
[90000,0.2,"Detailhandel"]
[101870,0.2,"Zakelijke dienstverlening"]
[159000,0.18099999999999999,"Industrie & Productie"]
[204262,0.1686,"Agri & Food"]
[215000,0.17050000000000001,"Gezondheidszorg & Farmacie"]
[220000,0.14099999999999999,"Zakelijke dienstverlening"]
[224000,0.25,"Horeca, Toerisme & Recreatie"]
[233000,0.193,"Groothandel"]
[256100,0.186,"IT, Online & E-commerce"]
[279000,0.2,"Zakelijke dienstverlening"]
[290000,0.18,"Anders"]
[311804,0.2,"IT, Online & E-commerce"]
[312144,0.18,"Detailhandel"]
[328000,0.1767,"Agri & Food"]
[340000,0.13320000000000001,"Detailhandel"]
[350000,0.2,"Detailhandel"]
[370000,0.16789999999999999,"Zakelijke dienstverlening"]
[388741,0.17,"Zakelijke dienstverlening"]
[390759,0.1585,"Horeca, Toerisme & Recreatie"]
[397370,0.15609999999999999,"Agri & Food"]
[407542,0.246,"Industrie & Productie"]
[432500,0.18,"Groothandel"]
[437500,0.15640000000000001,"IT, Online & E-commerce"]
[442075,0.18,"Bouw & Installatietechniek"]
[442495,0.14389999999999997,"Bouw & Installatietechniek"]
[450000,0.14699999999999999,"Detailhandel"]
[456292,0.12,"Detailhandel"]
[467000,0.183,"Bouw & Installatietechniek"]
[471645,0.1404,"Gezondheidszorg & Farmacie"]
[507000,0.1673,"Bouw & Installatietechniek"]
[516000,0.1651,"Bouw & Installatietechniek"]
[523150,0.18,"Bouw & Installatietechniek"]
[527000,0.18,"Media, Reclame & Communicatie"]
[548915,0.15,"Industrie & Productie"]
[555000,0.25,"Bouw & Installatietechniek"]
[565000,0.1759,"Industrie & Productie"]
{"$rows_left_out":357}
{"sheet":"Resultaten gekozen Branche","index":7,"n_rows":76,"n_cols":2,"rows_kept":76,"cut":false,"hidden":true,"merged":[]}
["OW van gekozen Branche","Keu van gekozen Branche"]
[{"$f":"IFERROR(_xlfn._xlws.FILTER('Resultaten spreidingsdiagrammen'!A2:A384,'Resultaten spreidingsdiagrammen'!C2:C384='Keu referentiemodel'!B9),\"\")","v":""},{"$f":"IFERROR(_xlfn._xlws.FILTER('Resultaten spreidingsdiagrammen'!B2:B384,'Resultaten spreidingsdiagrammen'!C2:C384='Keu referentiemodel'!B9),\"\")","v":""}]
[]
[]
[]
[]
[]
[]
[]
[]
[]
[]
[]
[]
[]
[]
[]
[]
[]
[]
[]
[]
[]
[]
[]
[]
[]
[]
[]
[]
[]
[]
[]
[]
[]
[]
[]
[]
[]
[]
{"$rows_left_out":36}